Target
Bifunctional epoxide hydrolase 2
Ligand
BDBM50327855
Substrate
Meas. Tech.
Fluorescent Based Assay
pH
7±n/a
IC50
0.7±n/a nM
Comments
extracted
Citation
 Hammock, BDRose, TMorisseau, CLee, KS Acyl piperidine inhibitors of soluble epoxide hydrolase US Patent  US9296693 Publication Date 3/29/2016 
Target
Name:
Bifunctional epoxide hydrolase 2
Synonyms:
Cytosolic epoxide hydrolase 2 EPHX2 HYES_HUMAN Soluble epoxide hydrolase (sEH) | epoxide hydrolase 2, cytoplasmic
Type:
Enzyme
Mol. Mass.:
62613.07
Organism:
Homo sapiens (Human)
Description:
P34913
Residue:
555
  
Inhibitor
Name:
BDBM50327855
Synonyms:
1-(1-Isonicotinoylpiperidin-4-yl)-3-(4-(trifluoromethoxy)phenyl)urea US9296693, 47
Type:
Small organic molecule
Emp. Form.:
C19H19F3N4O3
Mol. Mass.:
408.3744
SMILES:
FC(F)(F)Oc1ccc(NC(=O)NC2CCN(CC2)C(=O)c2ccncc2)cc1
: