Target
Kappa-type opioid receptor [I294A]
Ligand
BDBM21130
Substrate
Meas. Tech.
Homologous Competition Assay
pH
7.4±n/a
Temperature
298.15±n/a K
Ki
3e+1±9.7 nM
Comments
extracted
Citation
 Vardy, EMosier, PDFrankowski, KJWu, HKatritch, VWestkaemper, RBAubé, JStevens, RCRoth, BL Chemotype-selective modes of action of ¿-opioid receptor agonists. J Biol Chem 288:34470-83 (2013)  
Target
Name:
Kappa-type opioid receptor [I294A]
Synonyms:
Kappa opioid receptor (KOR I294A) OPRK1 | OPRK_HUMAN
Type:
Protein
Mol. Mass.:
42606.68
Organism:
Homo sapiens (Human)
Description:
Human KOR with I294A mutation
Residue:
380
  
Inhibitor
Name:
BDBM21130
Synonyms:
N-methyl-2-phenyl-N-[(5R,7S,8S)-7-(pyrrolidin-1-yl)-1-oxaspiro[4.5]decan-8-yl]acetamide U-69593 [3H]U69593
Type:
radiolabeled ligand
Emp. Form.:
C22H32N2O2
Mol. Mass.:
356.5017
SMILES:
CN([C@H]1CC[C@@]2(CCCO2)C[C@@H]1N1CCCC1)C(=O)Cc1ccccc1
: