Target
Diacylglycerol O-acyltransferase 1
Ligand
BDBM220395
Substrate
Meas. Tech.
PMSA Inhibition Assay
Ki
0.078±0.018 nM
IC50
1.76±0.41 nM
Citation
 Spiegel, DMurelli, RZhang, A Chimeric small molecules for the recruitment of antibodies to cancer cells US Patent  US9296708 Publication Date 3/29/2016 
Target
Name:
Diacylglycerol O-acyltransferase 1
Synonyms:
ACAT-related gene product 1 Acyl coA-diacylglycerol acyl transferase 1 (DGAT1) DGAT1 Diacylglycerol Acyltransferase (DGAT1) Diacylglycerol O-acyltransferase 1 (DGAT1) | Diglyceride acyltransferase
Type:
Protein
Mol. Mass.:
55297.82
Organism:
Homo sapiens (Human)
Description:
O75907
Residue:
488
  
Inhibitor
Name:
BDBM220395
Synonyms:
US9296708, 1, ARM-P0
Type:
Small organic molecule
Emp. Form.:
C21H26N8O11
Mol. Mass.:
566.4781
SMILES:
OC(=O)CC[C@H](NC(=O)N[C@@H](CCCCn1cc(CNc2ccc(cc2[N+]([O-])=O)[N+]([O-])=O)nn1)C(O)=O)C(O)=O
: