Target
Diacylglycerol O-acyltransferase 1
Ligand
BDBM220984
Substrate
Meas. Tech.
DGAT1 Inhibitory Assay
pH
7.4±n/a
Temperature
303.15±n/a K
IC50
1.6±n/a nM
Comments
extracted
Citation
 Sakurai, OSaruta, KHayashi, NGoi, TMorokuma, KTsujishima, HSawamoto, HShitama, HImashiro, R Continuous arycyclic compound US Patent  US9302996 Publication Date 4/5/2016 
Target
Name:
Diacylglycerol O-acyltransferase 1
Synonyms:
ACAT-related gene product 1 Acyl coA-diacylglycerol acyl transferase 1 (DGAT1) DGAT1 Diacylglycerol Acyltransferase (DGAT1) Diacylglycerol O-acyltransferase 1 (DGAT1) | Diglyceride acyltransferase
Type:
Protein
Mol. Mass.:
55297.82
Organism:
Homo sapiens (Human)
Description:
O75907
Residue:
488
  
Inhibitor
Name:
BDBM220984
Synonyms:
US9302996, 99-6
Type:
Small organic molecule
Emp. Form.:
C21H18ClF3N4O3
Mol. Mass.:
466.841
SMILES:
Cc1cc(OCC2(CCC2)C(O)=O)ncc1-c1cnc(-c2nc(c[nH]2)C(F)(F)F)c(Cl)c1
: