Target
RAC-alpha serine/threonine-protein kinase [1-123]
Ligand
BDBM223477
Substrate
Meas. Tech.
SPR Competitive Binding Assay
Kd
390±40 nM
Citation
 Mahadevan, DMeuillet, EJMash, Jr., EAGokhale, VMPowis, GZhang, S Small molecule inhibitors of the pleckstrin homology domain and methods for using same US Patent  US9320734 Publication Date 4/26/2016 
Target
Name:
RAC-alpha serine/threonine-protein kinase [1-123]
Synonyms:
AKT1 PKB RAC-alpha serine/threonine-protein kinase (Akt)
Type:
Enzyme
Mol. Mass.:
14664.42
Organism:
Homo sapiens (Human)
Description:
PLECKSTRIN HOMOLOGY DOMAIN RESIDUES 1-123 (PH Domain)
Residue:
123
  
Inhibitor
Name:
BDBM223477
Synonyms:
US9320734, 316
Type:
Small organic molecule
Emp. Form.:
C21H16ClN7O4S
Mol. Mass.:
497.914
SMILES:
CC1=NN(C(=O)c2ccc(Cl)cc2)C(=O)C1\N=N\c1ccc(cc1)S(=O)(=O)Nc1ncccn1
: