Target
Cyclin-dependent kinase 2
Ligand
BDBM91808
Substrate
Meas. Tech.
OctetRed_Method1
Kd
>100000±n/a nM
Citation
 D3R, DD CSAR CDK2-CyclinA D3R 219:0 (2015) Target
Name:
Cyclin-dependent kinase 2
Synonyms:
CDK2 CDK2_HUMAN Cell division protein kinase 2 Protein cereblon/Cyclin-dependent kinase 2 | p33 protein kinase
Type:
Enzyme Subunit
Mol. Mass.:
33938.17
Organism:
Homo sapiens (Human)
Description:
P24941
Residue:
298
  
Inhibitor
Name:
BDBM91808
Synonyms:
CS71
Type:
Emp. Form.:
C21H21N5O3S
Mol. Mass.:
423.488
SMILES:
CC(=O)Nc1cccc(c1)-c1nnc(SCC(=O)Nc2ccc(cc2)C(C)=O)n1C
: