Target
Cyclin-dependent kinase 2
Ligand
BDBM225315
Substrate
Meas. Tech.
OctetRed_Method1
Kd
910±227 nM
Citation
 D3R, DD CSAR CDK2 Kinase D3R 220:0 (2015) Target
Name:
Cyclin-dependent kinase 2
Synonyms:
CDK2 CDK2_HUMAN Cell division protein kinase 2 Protein cereblon/Cyclin-dependent kinase 2 | p33 protein kinase
Type:
Enzyme Subunit
Mol. Mass.:
33938.17
Organism:
Homo sapiens (Human)
Description:
P24941
Residue:
298
  
Inhibitor
Name:
BDBM225315
Synonyms:
CS10
Type:
Small Organic Molecule
Emp. Form.:
C18H17N3OS
Mol. Mass.:
323.412
SMILES:
O=C(Cc1ccc(cc1)-c1cccs1)Nc1cc([nH]n1)C1CC1
: