Target
Cyclin-dependent kinase 2
Ligand
BDBM91749
Substrate
Meas. Tech.
OctetRed_Method1
Kd
77.3±35.7 nM
Citation
 D3R, DD CSAR CDK2 Kinase D3R 220:0 (2015) Target
Name:
Cyclin-dependent kinase 2
Synonyms:
CDK2 CDK2_HUMAN Cell division protein kinase 2 Protein cereblon/Cyclin-dependent kinase 2 | p33 protein kinase
Type:
Enzyme Subunit
Mol. Mass.:
33938.17
Organism:
Homo sapiens (Human)
Description:
P24941
Residue:
298
  
Inhibitor
Name:
BDBM91749
Synonyms:
CS16
Type:
Emp. Form.:
C15H13N5O2S
Mol. Mass.:
327.361
SMILES:
Cc1nc(C)c(s1)-c1ccnc(Nc2cccc(c2)[N+]([O-])=O)n1
: