Target
Cyclin-dependent kinase 2
Ligand
BDBM91785
Substrate
Meas. Tech.
OctetRed_Method1
Kd
>100000±n/a nM
Citation
 D3R, DD CSAR CDK2 Kinase D3R 220:0 (2015) Target
Name:
Cyclin-dependent kinase 2
Synonyms:
CDK2 CDK2_HUMAN Cell division protein kinase 2 Protein cereblon/Cyclin-dependent kinase 2 | p33 protein kinase
Type:
Enzyme Subunit
Mol. Mass.:
33938.17
Organism:
Homo sapiens (Human)
Description:
P24941
Residue:
298
  
Inhibitor
Name:
BDBM91785
Synonyms:
CS31
Type:
Emp. Form.:
C17H15FN4O3S2
Mol. Mass.:
406.454
SMILES:
CCc1nnc(NS(=O)(=O)c2ccc(NC(=O)c3ccc(F)cc3)cc2)s1
: