Target
Cyclin-dependent kinase 2
Ligand
BDBM91794
Substrate
Meas. Tech.
OctetRed_Method1
Kd
>100000±n/a nM
Citation
 D3R, DD CSAR CDK2 Kinase D3R 220:0 (2015) Target
Name:
Cyclin-dependent kinase 2
Synonyms:
CDK2 CDK2_HUMAN Cell division protein kinase 2 Protein cereblon/Cyclin-dependent kinase 2 | p33 protein kinase
Type:
Enzyme Subunit
Mol. Mass.:
33938.17
Organism:
Homo sapiens (Human)
Description:
P24941
Residue:
298
  
Inhibitor
Name:
BDBM91794
Synonyms:
CS46
Type:
Emp. Form.:
C18H19N3O5
Mol. Mass.:
357.3606
SMILES:
[O-][N+](=O)c1ccccc1OCC(=O)Nc1ccccc1N1CCOCC1
: