Target
Cyclin-dependent kinase 2
Ligand
BDBM91778
Substrate
Meas. Tech.
OctetRed_Method1
Kd
>100000±n/a nM
Citation
 D3R, DD CSAR CDK2 Kinase D3R 220:0 (2015) Target
Name:
Cyclin-dependent kinase 2
Synonyms:
CDK2 CDK2_HUMAN Cell division protein kinase 2 Protein cereblon/Cyclin-dependent kinase 2 | p33 protein kinase
Type:
Enzyme Subunit
Mol. Mass.:
33938.17
Organism:
Homo sapiens (Human)
Description:
P24941
Residue:
298
  
Inhibitor
Name:
BDBM91778
Synonyms:
CS238
Type:
Emp. Form.:
C26H26ClN3O5S
Mol. Mass.:
528.02
SMILES:
Cc1ccc(NS(=O)(=O)c2cc(ccc2Cl)C(=O)Nc2ccccc2C(=O)N2CCOCC2)c(C)c1
: