Target
Serine/threonine-protein kinase Chk1 [2-280]
Ligand
BDBM225340
Substrate
Meas. Tech.
33P-Radiometric_Method1
Ki
459±n/a nM
Citation
 D3R, DD Abbott CHK1 Kinase D3R 221:0 (2015) Target
Name:
Serine/threonine-protein kinase Chk1 [2-280]
Synonyms:
CHEK1 CHK1_HUMAN | CHK1_Kinase
Type:
Mol. Mass.:
32109.16
Organism:
Homo sapiens (Human)
Description:
O14757[2-280]
Residue:
279
  
Inhibitor
Name:
BDBM225340
Synonyms:
Chk1_24
Type:
Small Organic Molecule
Emp. Form.:
C28H29N3O
Mol. Mass.:
423.5494
SMILES:
CC1CCC(CC1)NCc1ccc-2c(Cc3c-2n[nH]c3-c2ccc3cc(O)ccc3c2)c1
: