Target
Serine/threonine-protein kinase Chk1 [2-280]
Ligand
BDBM91897
Substrate
Meas. Tech.
33P-Radiometric_Method1
Ki
6050±n/a nM
Citation
 D3R, DD Abbott CHK1 Kinase D3R 221:0 (2015) Target
Name:
Serine/threonine-protein kinase Chk1 [2-280]
Synonyms:
CHEK1 CHK1_HUMAN | CHK1_Kinase
Type:
Mol. Mass.:
32109.16
Organism:
Homo sapiens (Human)
Description:
O14757[2-280]
Residue:
279
  
Inhibitor
Name:
BDBM91897
Synonyms:
Chk1_31
Type:
Emp. Form.:
C22H20ClN5O2
Mol. Mass.:
421.88
SMILES:
CC(C)c1ccc(COc2ccc(Cl)cc2NC(=O)Nc2cnc(cn2)C#N)cc1
: