Target
Serine/threonine-protein kinase Chk1 [2-280]
Ligand
BDBM91925
Substrate
Meas. Tech.
33P-Radiometric_Method1
Ki
>10000±n/a nM
Citation
 D3R, DD Abbott CHK1 Kinase D3R 221:0 (2015) Target
Name:
Serine/threonine-protein kinase Chk1 [2-280]
Synonyms:
CHEK1 CHK1_HUMAN | CHK1_Kinase
Type:
Mol. Mass.:
32109.16
Organism:
Homo sapiens (Human)
Description:
O14757[2-280]
Residue:
279
  
Inhibitor
Name:
BDBM91925
Synonyms:
Chk1_58
Type:
Emp. Form.:
C21H17N3O3
Mol. Mass.:
359.378
SMILES:
Nc1cccc(c1)-c1ccc2c(Nc3ccc(CC(O)=O)cc3NC2=O)c1
: