Target
Serine/threonine-protein kinase Chk1 [2-280]
Ligand
BDBM225357
Substrate
Meas. Tech.
33P-Radiometric_Method1
Ki
>10000±n/a nM
Citation
 D3R, DD Abbott CHK1 Kinase D3R 221:0 (2015) Target
Name:
Serine/threonine-protein kinase Chk1 [2-280]
Synonyms:
CHEK1 CHK1_HUMAN | CHK1_Kinase
Type:
Mol. Mass.:
32109.16
Organism:
Homo sapiens (Human)
Description:
O14757[2-280]
Residue:
279
  
Inhibitor
Name:
BDBM225357
Synonyms:
Chk1_93
Type:
Small Organic Molecule
Emp. Form.:
C9H7N7O2
Mol. Mass.:
245.1976
SMILES:
Oc1cc(NC(=O)Nc2cnc(cn2)C#N)n[nH]1
: