Target
Serine/threonine-protein kinase Chk1 [2-280]
Ligand
BDBM225362
Substrate
Meas. Tech.
33P-Radiometric_Method1
Ki
4.38±n/a nM
Citation
 D3R, DD Abbott CHK1 Kinase D3R 221:0 (2015) Target
Name:
Serine/threonine-protein kinase Chk1 [2-280]
Synonyms:
CHEK1 CHK1_HUMAN | CHK1_Kinase
Type:
Mol. Mass.:
32109.16
Organism:
Homo sapiens (Human)
Description:
O14757[2-280]
Residue:
279
  
Inhibitor
Name:
BDBM225362
Synonyms:
Chk1_104
Type:
Small Organic Molecule
Emp. Form.:
C29H27N3O3
Mol. Mass.:
465.543
SMILES:
OC1CCC(CC1)NC(=O)c1ccc-2c(Cc3c-2n[nH]c3-c2ccc(cc2)-c2ccc(O)cc2)c1
: