Target
Mitogen-activated protein kinase 1
Ligand
BDBM92202
Substrate
Meas. Tech.
Photometric_Method2
Ki
3±n/a nM
Citation
 D3R, DD Vertex ERK2 D3R 222:0 (2015) Target
Name:
Mitogen-activated protein kinase 1
Synonyms:
ERK2 Extracellular signal-regulated kinase 2 Extracellular signal-regulated kinase 2 (ERK2) MAPK 2 MK01_HUMAN Mitogen-activated protein kinase 1 (ERK-2) Mitogen-activated protein kinase 2 PRKM2 | p42-MAPK
Type:
Ser/Thr Protein Kinase
Mol. Mass.:
41392.76
Organism:
Homo sapiens (Human)
Description:
P28482
Residue:
360
  
Inhibitor
Name:
BDBM92202
Synonyms:
erk000661
Type:
Emp. Form.:
C19H21ClN6O4S
Mol. Mass.:
464.926
SMILES:
Cc1cnc(NNS(C)(=O)=O)nc1-c1c[nH]c(c1)C(=O)N[C@H](CO)c1cccc(Cl)c1
: