Target
UDP-3-O-acyl-N-acetylglucosamine deacetylase
Ligand
BDBM92280
Substrate
Meas. Tech.
Thermofluor_Method1
Kd
15600±1400 nM
Citation
 D3R, DD CSAR LpxC D3R 224:0 (2015) Target
Name:
UDP-3-O-acyl-N-acetylglucosamine deacetylase
Synonyms:
LPXC_PSEAE UDP-3-O-[3-hydroxymyristoyl] N-acetylglucosamine deacetylase UDP-3-O-[3-hydroxymyristoyl] N-acetylglucosamine deacetylase (LpxC) UDP-3-O-acyl-GlcNAc deacetylase (LpxC) lpxC
Type:
Enzyme
Mol. Mass.:
33428.15
Organism:
Pseudomonas aeruginosa
Description:
P47205
Residue:
303
  
Inhibitor
Name:
BDBM92280
Synonyms:
CS274
Type:
Emp. Form.:
C19H20N2O3
Mol. Mass.:
324.3737
SMILES:
CCCc1ccc(cc1)-c1ccc(cc1)C1=N[C@H](CO1)C(=O)NO
: