Target
Urokinase-type plasminogen activator [179-424,C299A,N323Q]
Ligand
BDBM92318
Substrate
Meas. Tech.
Photometric_Method1
Ki
223±n/a nM
Citation
 D3R, DD Abbott Urokinase D3R 227:0 (2015) Target
Name:
Urokinase-type plasminogen activator [179-424,C299A,N323Q]
Synonyms:
PLAU Urokinase
Type:
Mol. Mass.:
27687.84
Organism:
Homo sapiens (Human)
Description:
P00749[179-424,C299A,N323Q]
Residue:
246
  
Inhibitor
Name:
BDBM92318
Synonyms:
uPa_40
Type:
Emp. Form.:
C29H33N3
Mol. Mass.:
423.5924
SMILES:
CN1CCc2ccc(\C=C\c3ccc4cc(ccc4c3)C(N)=N)cc2C1C1CCCCC1
: