Target
Urokinase-type plasminogen activator [179-424,C299A,N323Q]
Ligand
BDBM92319
Substrate
Meas. Tech.
Photometric_Method1
Ki
42±n/a nM
Citation
 D3R, DD Abbott Urokinase D3R 227:0 (2015) Target
Name:
Urokinase-type plasminogen activator [179-424,C299A,N323Q]
Synonyms:
PLAU Urokinase
Type:
Mol. Mass.:
27687.84
Organism:
Homo sapiens (Human)
Description:
P00749[179-424,C299A,N323Q]
Residue:
246
  
Inhibitor
Name:
BDBM92319
Synonyms:
uPa_41
Type:
Emp. Form.:
C28H31N3
Mol. Mass.:
409.5658
SMILES:
CN1CCc2ccc(cc2C1C1CCC1)C1CC1c1ccc2cc(ccc2c1)C(N)=N
: