Target
Heat shock protein HSP 90-beta
Ligand
BDBM225749
Substrate
Meas. Tech.
FRET Assay
IC50
11.5±n/a nM
Citation
 D3R, DD AbbVie-CSAR HSP90 D3R 408:0 (2016) Target
Name:
Heat shock protein HSP 90-beta
Synonyms:
HS90B_HUMAN HSP 90 HSP90B HSPCB Heat shock protein HSP 90 (Hsp90)
Type:
Molecular Chaperone
Mol. Mass.:
83229.45
Organism:
Homo sapiens (Human)
Description:
P08238
Residue:
724
  
Inhibitor
Name:
BDBM225749
Synonyms:
hsp90_46
Type:
Small Organic Molecule
Emp. Form.:
C24H18BrN3O5S
Mol. Mass.:
540.386
SMILES:
Oc1cc(O)c(cc1Br)-n1c2ccc(CNS(=O)(=O)c3cccc4ccccc34)cc2[nH]c1=O
: