Target
Heat shock protein HSP 90-beta
Ligand
BDBM225833
Substrate
Meas. Tech.
FRET Assay
IC50
130±n/a nM
Citation
 D3R, DD AbbVie-CSAR HSP90 D3R 408:0 (2016) Target
Name:
Heat shock protein HSP 90-beta
Synonyms:
HS90B_HUMAN HSP 90 HSP90B HSPCB Heat shock protein HSP 90 (Hsp90)
Type:
Molecular Chaperone
Mol. Mass.:
83229.45
Organism:
Homo sapiens (Human)
Description:
P08238
Residue:
724
  
Inhibitor
Name:
BDBM225833
Synonyms:
hsp90_123
Type:
Small Organic Molecule
Emp. Form.:
C20H24O6
Mol. Mass.:
360.401
SMILES:
OC(=O)[C@]12CCCCC1C[C@H](CC2)OC(=O)\C=C\c1ccc(O)c(O)c1
: