Target
Mitogen-activated protein kinase kinase kinase kinase 4
Ligand
BDBM225900
Substrate
Meas. Tech.
Z'Lyte Assay
Ki
148±n/a nM
IC50
139±n/a nM
Citation
 D3R, DD Genentech MAP4K4 D3R 409:0 (2016) Target
Name:
Mitogen-activated protein kinase kinase kinase kinase 4
Synonyms:
HGK KIAA0687 MAP4K4 MAPK/ERK kinase kinase kinase 4 MEKKK 4 NIK | Nck-interacting kinase
Type:
Serine/threonine-protein kinase
Mol. Mass.:
142114.73
Organism:
Homo sapiens (Human)
Description:
O95819
Residue:
1239
  
Inhibitor
Name:
BDBM225900
Synonyms:
MAP18
Type:
Small Organic Molecule
Emp. Form.:
C22H22FN3O2
Mol. Mass.:
379.4274
SMILES:
Nc1ncc(C(=O)N[C@H]2CCC[C@@H](O)C2)c2ccc(cc12)-c1cccc(F)c1
: