Target
Bile acid receptor
Ligand
BDBM225920
Substrate
Meas. Tech.
Scintillation Proximity Assay (SPA)
pH
7.4±n/a
IC50
6250±n/a nM
Comments
extracted
Citation
 D3R, DD Drug Design Data Resource Grand Challenge 2 Dataset: FXR - Farnesoid X Receptor D3R 882:0 (2017) Target
Name:
Bile acid receptor
Synonyms:
BAR FXR HRR1 NR1H4_HUMAN RIP14 Retinoid X receptor-interacting protein 14 | farnesoid x receptor
Type:
Nuclear Receptor
Mol. Mass.:
55916.24
Organism:
Homo sapiens (Human)
Description:
Q96RI1
Residue:
486
  
Inhibitor
Name:
BDBM225920
Synonyms:
FXR_9
Type:
Small Organic Molecule
Emp. Form.:
C28H33N7O
Mol. Mass.:
483.6079
SMILES:
O=C(NC1CCCCC1)[C@H](C1CCCCC1)n1c(nc2ccccc12)-c1ccc(cc1)-c1nnn[nH]1
: