Target
Coagulation factor X
Ligand
BDBM226037
Substrate
Meas. Tech.
D3R245
IC50
27±n/a nM
Citation
 D3R, DD GSK FactorXA-1 D3R 245:0 (2015) Target
Name:
Coagulation factor X
Synonyms:
Activated coagulation factor X (FXa) Coagulation factor X precursor F10 Factor X heavy chain Factor Xa Stuart-Prower factor
Type:
Enzyme
Mol. Mass.:
54726.60
Organism:
Homo sapiens (Human)
Description:
Residue:
488
  
Inhibitor
Name:
BDBM226037
Synonyms:
GTC000025A
Type:
Small Organic Molecule
Emp. Form.:
C23H28ClN3O6S2
Mol. Mass.:
542.068
SMILES:
CCC(=O)CN([C@H]1CCN([C@@H](C)C(=O)N2CCOCC2)C1=O)S(=O)(=O)c1cc2ccc(Cl)cc2s1
: