Target
Coagulation factor X
Ligand
BDBM12569
Substrate
Meas. Tech.
D3R246
IC50
1.11±n/a nM
Citation
 D3R, DD GSK FactorXA-2 D3R 246:0 (2015) Target
Name:
Coagulation factor X
Synonyms:
Activated coagulation factor X (FXa) Coagulation factor X precursor F10 Factor X heavy chain Factor Xa Stuart-Prower factor
Type:
Enzyme
Mol. Mass.:
54726.60
Organism:
Homo sapiens (Human)
Description:
Residue:
488
  
Inhibitor
Name:
BDBM12569
Synonyms:
GTC000006A pyrrolidin-2-one-based inhibitor 28
Type:
Small organic molecule
Emp. Form.:
C25H30ClN3O6S
Mol. Mass.:
536.04
SMILES:
CCC(=O)CN([C@H]1CCN([C@@H](C)C(=O)N2CCOCC2)C1=O)S(=O)(=O)c1ccc2cc(Cl)ccc2c1
: