Target
Coagulation factor X
Ligand
BDBM226115
Substrate
Meas. Tech.
D3R246
IC50
1688±n/a nM
Citation
 D3R, DD GSK FactorXA-2 D3R 246:0 (2015) Target
Name:
Coagulation factor X
Synonyms:
Activated coagulation factor X (FXa) Coagulation factor X precursor F10 Factor X heavy chain Factor Xa Stuart-Prower factor
Type:
Enzyme
Mol. Mass.:
54726.60
Organism:
Homo sapiens (Human)
Description:
Residue:
488
  
Inhibitor
Name:
BDBM226115
Synonyms:
GTC000106A
Type:
Small Organic Molecule
Emp. Form.:
C23H23ClFN3O4S2
Mol. Mass.:
524.028
SMILES:
CC(C)N(C)C(=O)c1ccc(N2CC[C@H](NS(=O)(=O)c3cc4ccc(Cl)cc4s3)C2=O)c(F)c1
: