Target
Serine/threonine-protein kinase pim-1
Ligand
BDBM227253
Substrate
Meas. Tech.
PIM Kinase Binding Assay
pH
7.2±n/a
Temperature
298.15±n/a K
Ki
0.001±n/a nM
Comments
extracted
Citation
 Burch, JSun, MWang, XBlackaby, WHodges, AJSharpe, A Cyclic ether pyrazol-4-yl-heterocyclyl-carboxamide compounds and methods of use US Patent  US9328106 Publication Date 5/3/2016 
Target
Name:
Serine/threonine-protein kinase pim-1
Synonyms:
PIM-1 Kinase PIM1_HUMAN Serine/threonine-protein kinase (PIM1) Serine/threonine-protein kinase PIM1 | Serine/threonine-protein kinase pim-1 (PIM1)
Type:
Protein
Mol. Mass.:
35681.82
Organism:
Homo sapiens (Human)
Description:
P11309
Residue:
313
  
Inhibitor
Name:
BDBM227253
Synonyms:
US9328106, 204
Type:
Small organic molecule
Emp. Form.:
C25H25F4N5O3
Mol. Mass.:
519.4913
SMILES:
Cn1ncc(NC(=O)c2ccc(F)c(n2)-c2c(F)cc(cc2F)C2(O)CC2)c1[C@@H]1CC[C@@H](N)[C@H](F)CO1
: