Target
Bromodomain-containing protein 4 [44-166,P82A]
Ligand
BDBM227644
Substrate
Meas. Tech.
TR-FRET Competition Assay
pH
7.5±0
Temperature
277.15±0 K
Kd
1.12e+4± 7e+2 nM
Citation
 Jung, MPhilpott, MMüller, SSchulze, JBadock, VEberspächer, UMoosmayer, DBader, BSchmees, NFernández-Montalván, AHaendler, B Affinity map of bromodomain protein 4 (BRD4) interactions with the histone H4 tail and the small molecule inhibitor JQ1. J Biol Chem 289:9304-19 (2014)  
Target
Name:
Bromodomain-containing protein 4 [44-166,P82A]
Synonyms:
BRD4 Bromodomain protein 4 bromodomain 1 (BRD4 BD1 P82A) | HUNK1
Type:
Protein
Mol. Mass.:
14584.25
Organism:
Homo sapiens (Human)
Description:
Human BRD4 BD1 (44-166 aa) P82A mutant
Residue:
123
  
Inhibitor
Name:
BDBM227644
Synonyms:
Histone H4 (1-25) | MSGRGKGGKGLGKGGAKRHRKVLRD
Type:
Small organic molecule
Emp. Form.:
C108H196N44O29S
Mol. Mass.:
2607.054
SMILES:
CSCC[C@H](N)C(=O)N[C@@H](CO)C(=O)NCC(=O)N[C@@H](CCCNC(N)=N)C(=O)NCC(=O)N[C@@H](CCCCN)C(=O)NCC(=O)NCC(=O)N[C@@H](CCCCN)C(=O)NCC(=O)N[C@@H](CC(C)C)C(=O)NCC(=O)N[C@@H](CCCCN)C(=O)NCC(=O)NCC(=O)N[C@@H](C)C(=O)N[C@@H](CCCCN)C(=O)N[C@@H](CCCNC(N)=N)C(=O)N[C@@H](Cc1cnc[nH]1)C(=O)N[C@@H](CCCNC(N)=N)C(=O)N[C@@H](CCCCN)C(=O)N[C@@H](C(C)C)C(=O)N[C@@H](CC(C)C)C(=O)N[C@@H](CCCNC(N)=N)C(=O)N[C@@H](CC(O)=O)C(O)=O
: