Target
Bone morphogenetic protein receptor type-1A
Ligand
BDBM148372
Substrate
Meas. Tech.
ALK1-6 enzymatic assays
pH
7.5±n/a
IC50
89±n/a nM
Comments
extracted
Citation
 Alimardanov, ACuny, GDGrewal, GSLee, AMcKew, JCMohedas, AHShen, MXu, XYu, PB BMP inhibitors and methods of use thereof US Patent  US9682983 Publication Date 6/20/2017 
Target
Name:
Bone morphogenetic protein receptor type-1A
Synonyms:
ACVRLK3 Activin receptor-like kinase 3 (ALK-3) BMR1A_HUMAN
Type:
Enzyme
Mol. Mass.:
60204.46
Organism:
Homo sapiens (Human)
Description:
P36894
Residue:
532
  
Inhibitor
Name:
BDBM148372
Synonyms:
US10017516, Compound 33 | US9682983, 33
Type:
Small organic molecule
Emp. Form.:
C26H25N7
Mol. Mass.:
435.5236
SMILES:
C[C@H]1CNC[C@@H](C)N1c1ccc(cn1)-c1cnc2c(cnn2c1)-c1ccnc2ccccc12
: