Target
Fatty acid-binding protein 5-ANS
Ligand
BDBM22988
Substrate
Meas. Tech.
Fluorescence Competition Assay
Kd
100.3±8.3 nM
Citation
 Yu, SLevi, LCasadesus, GKunos, GNoy, N Fatty acid-binding protein 5 (FABP5) regulates cognitive function both by decreasing anandamide levels and by activating the nuclear receptor peroxisome proliferator-activated receptor ß/d (PPARß/d) in the brain. J Biol Chem 289:12748-58 (2014)  
Target
Name:
Fatty acid-binding protein 5-ANS
Synonyms:
FABP5-ANS
Type:
Protein
Mol. Mass.:
Description:
Components:
This complex has 2 components.
Component 1
Name:
Fatty acid-binding protein 5
Synonyms:
FABP5_MOUSE Fabpe Klbp | Mal1
Type:
Protein
Mol. Mass.:
15137.27
Organism:
Mus musculus (Mouse)
Description:
Q05816
Residue:
135
  
Component 2
Name:
BDBM60927
Synonyms:
1-anilinonaphthalene-8-sulfonic acid ANS BDBM50126831
Type:
Emp. Form.:
C16H13NO3S
Mol. Mass.:
299.344
SMILES:
OS(=O)(=O)c1cccc2cccc(Nc3ccccc3)c12
:
Inhibitor
Name:
BDBM22988
Synonyms:
(5Z,8Z,11Z,14Z)-N-(2-hydroxyethyl)icosa-5,8,11,14-tetraenamide ANANDAMIDE Arachidonoyl ethanolamide (AEA) Arachidonylethanolamide [14C]Anandamide | [3H]Anandamide
Type:
radiolabeled substrate
Emp. Form.:
C22H37NO2
Mol. Mass.:
347.5347
SMILES:
CCCCC\C=C/C\C=C/C\C=C/C\C=C/CCCC(=O)NCCO
: