Target
Transient receptor potential cation channel subfamily V member 4
Ligand
BDBM230279
Substrate
Meas. Tech.
Inhibition Assay
Temperature
310.15±n/a K
Ki
450±n/a nM
IC50
1400±n/a nM
Comments
extracted
Citation
 Yukimasa, A Aromatic heterocyclic derivative having TRPV4-inhibiting activity US Patent  US9340500 Publication Date 5/17/2016 
Target
Name:
Transient receptor potential cation channel subfamily V member 4
Synonyms:
TRPV4 Transient receptor potential cation channel subfamily V member 4 (TRPV4) VROAC
Type:
Enzyme
Mol. Mass.:
98290.10
Organism:
Homo sapiens (Human)
Description:
Q9HBA0
Residue:
871
  
Inhibitor
Name:
BDBM230279
Synonyms:
US9340500, I-123
Type:
Small organic molecule
Emp. Form.:
C26H37F3N4O
Mol. Mass.:
478.5934
SMILES:
Cc1c(cc(n1CC(C)(C)CN1CCNCC1)C(C)(C)C)C(=O)Nc1cccc(c1)C(F)(F)F
: