Target
Histone deacetylase 1
Ligand
BDBM50432560
Substrate
Meas. Tech.
Fluorescent Activity Assay
Temperature
298.15±n/a K
IC50
60.7±3.2 nM
Comments
extracted
Citation
 Lin, JFang, JChern, TChen, JChen, CWei, T 3,5,N-trihydroxy-alkanamide and derivatives: method for making same and use thereof US Patent  US9353061 Publication Date 5/31/2016 
Target
Name:
Histone deacetylase 1
Synonyms:
Cereblon/Histone deacetylase 1 HDAC1 Histone deacetylase 1 (HDAC1) RPD3L1
Type:
Enzyme
Mol. Mass.:
55090.27
Organism:
Homo sapiens (Human)
Description:
Q13547
Residue:
482
  
Inhibitor
Name:
BDBM50432560
Synonyms:
CHEMBL2347007 | US9353061, Simva-HA (2)
Type:
Small organic molecule
Emp. Form.:
C25H41NO6
Mol. Mass.:
451.5961
SMILES:
CCC(C)(C)C(=O)O[C@H]1C[C@@H](C)C=C2C=C[C@H](C)[C@H](CC[C@@H](O)C[C@@H](O)CC(=O)NO)[C@@H]12
: