Target
UDP-glucuronosyltransferase 1A1
Ligand
BDBM50022815
Substrate
β-estradiol
Meas. Tech.
UDP-glucuronosyltransferase Activity Assay
IC50
4.8e+4± 1.2e+4 nM
Citation
 Liu, YShe, MWu, ZDai, R The inhibition study of human UDP-glucuronosyltransferases with cytochrome P450 selective substrates and inhibitors. J Enzyme Inhib Med Chem 26:386-93 (2011)  
Target
Name:
UDP-glucuronosyltransferase 1A1
Synonyms:
Bilirubin-specific UDPGT isozyme 1 UD11_HUMAN UDP-glucuronosyltransferase 1-A UDPGT 1-1 UGT1 UGT1-01 UGT1A Uridine-5'-diphosphoglucuronosyltransferase 1A1 | hUG-BR1
Type:
Enzyme
Mol. Mass.:
59604.34
Organism:
Homo sapiens (Human)
Description:
P22309
Residue:
533
  
Inhibitor
Name:
BDBM50022815
Synonyms:
(3S,6S,9S,12R,15S,18S,21S,24S,30S,33S)-30-ethyl-33-[(1R,2R,4E)-1-hydroxy-2-methylhex-4-en-1-yl]-1,4,7,10,12,15,19,25,28-nonamethyl-6,9,18,24-tetrakis(2-methylpropyl)-3,21-bis(propan-2-yl)-1,4,7,10,13,16,19,22,25,28,31-undecaazacyclotritriacontan-2,5,8,11,14,17,20,23,26,29,32-undecone 30-Ethyl-33-(1-hydroxy-2-methyl-hex-4-enyl)-6,9,18,24-tetraisobutyl-3,21-diisopropyl-1,4,7,10,12,15,19,25,28-nonamethyl-1,4,7,10,13,16,19,22,25,28,31undecaaza-cyclotritriacontan-2,5,8,11,14,17,20,23,26,29,32-undecaone Cyclosporin A Cyclosproine A US9138393, Cyclosporin A
Type:
Small organic molecule
Emp. Form.:
C62H111N11O12
Mol. Mass.:
1202.6112
SMILES:
CC[C@@H]1NC(=O)[C@H]([C@H](O)[C@H](C)C\C=C\C)N(C)C(=O)[C@H](C(C)C)N(C)C(=O)[C@H](CC(C)C)N(C)C(=O)[C@H](CC(C)C)N(C)C(=O)[C@@H](C)NC(=O)[C@H](C)NC(=O)[C@H](CC(C)C)N(C)C(=O)[C@@H](NC(=O)[C@H](CC(C)C)N(C)C(=O)CN(C)C1=O)C(C)C
:
Substrate
Name:
BDBM17292
Synonyms:
(1S,10R,11S,14S,15S)-15-methyltetracyclo[8.7.0.0^{2,7}.0^{11,15}]heptadeca-2,4,6-triene-5,14-diol 17α-ethinylestradiol CHEMBL135 ESTRADIOL Ovocyclin US9040509, E2 US9561238, E2 [2,4,6,7-3H]-E2 [3H]]estradiol
Type:
Steroid
Emp. Form.:
C18H24O2
Mol. Mass.:
272.382
SMILES:
[H][C@@]12CC[C@H](O)[C@@]1(C)CC[C@]1([H])c3ccc(O)cc3CC[C@@]21[H]
: