Target
Platelet-derived growth factor subunit B
Ligand
BDBM234586
Substrate
Meas. Tech.
Kinase Assay
pH
7.4±n/a
IC50
12±n/a nM
Comments
extracted
Citation
 Boral, SMalone, TCWang, S Indole-1-carboxamides as kinase inhibitors US Patent  US9353093 Publication Date 5/31/2016 
Target
Name:
Platelet-derived growth factor subunit B
Synonyms:
PDGF PDGFB Platelet-derived growth factor subunit B SIS
Type:
Enzyme
Mol. Mass.:
27298.80
Organism:
Homo sapiens (Human)
Description:
P01127
Residue:
241
  
Inhibitor
Name:
BDBM234586
Synonyms:
US9353093, 8
Type:
Small organic molecule
Emp. Form.:
C23H20N4O3
Mol. Mass.:
400.4299
SMILES:
COc1cccc(NC(=O)Nc2ccc(cc2)-c2cc3ccccc3n2C(N)=O)c1
: