Target
Calcium/calmodulin-dependent protein kinase type II subunit delta
Ligand
BDBM292602
Substrate
Meas. Tech.
CaMKII delta Biochemical Assay
IC50
1.07±n/a nM
Citation
 Elzein, EKalla, RVKoltun, DLi, XParkhill, EQPerry, TSimonovich, SPZablocki, JZiebenhaus, CA Fused heterocyclic compounds as CaM kinase inhibitors US Patent  US10100058 Publication Date 10/16/2018 
Target
Name:
Calcium/calmodulin-dependent protein kinase type II subunit delta
Synonyms:
CAMK2D CaM kinase II CaMK-II subunit delta Calcium/calmodulin-dependent protein kinase type II subunit delta (CAMK2D) KCC2D_HUMAN
Type:
Enzyme Catalytic Domain
Mol. Mass.:
56419.78
Organism:
Homo sapiens (Human)
Description:
Q13557
Residue:
499
  
Inhibitor
Name:
BDBM292602
Synonyms:
N-(2-(diethylamino)ethyl)-2-(3-hydroxy-3-methylazetidin-1-yl)-6-(5-(thiophen-2-yl)pyrazolo[1,5-a]pyrimidin-3-yl)isonicotinamide | US10100058, Example 258
Type:
Small organic molecule
Emp. Form.:
C26H31N7O2S
Mol. Mass.:
505.635
SMILES:
CCN(CC)CCNC(=O)c1cc(nc(c1)-c1cnn2ccc(nc12)-c1cccs1)N1CC(C)(O)C1
: