Target
Isoform PDE10A2 of cAMP and cAMP-inhibited cGMP 3',5'-cyclic phosphodiesterase 10A (PDE10A2)
Ligand
BDBM234713
Substrate
Meas. Tech.
Fluorescence Polarization Assay
Ki
0.013±n/a nM
Citation
 Kuduk, SDMcComas, CCReger, TSQi, C Substituted pyridizinone derivatives as PDE10 inhibitors US Patent  US9353104 Publication Date 5/31/2016 
Target
Name:
Isoform PDE10A2 of cAMP and cAMP-inhibited cGMP 3',5'-cyclic phosphodiesterase 10A (PDE10A2)
Synonyms:
PDE10A Phosphodiesterase 10A Phosphodiesterase 10A2 cAMP and cAMP-inhibited cGMP 3',5'-cyclic phosphodiesterase 10A (PDE10A2)
Type:
Enzyme
Mol. Mass.:
89387.03
Organism:
Homo sapiens (Human)
Description:
Q9Y233-2
Residue:
789
  
Inhibitor
Name:
BDBM234713
Synonyms:
US9353104, 1
Type:
Small organic molecule
Emp. Form.:
C13H15BrN4O2
Mol. Mass.:
339.188
SMILES:
Cn1ccc(n1)[C@H]1C[C@@H]1COc1cc(Br)c(=O)n(C)n1
: