Target
Isoform PDE10A2 of cAMP and cAMP-inhibited cGMP 3',5'-cyclic phosphodiesterase 10A (PDE10A2)
Ligand
BDBM234726
Substrate
Meas. Tech.
Fluorescence Polarization Assay
Ki
0.003±n/a nM
Citation
 Kuduk, SDMcComas, CCReger, TSQi, C Substituted pyridizinone derivatives as PDE10 inhibitors US Patent  US9353104 Publication Date 5/31/2016 
Target
Name:
Isoform PDE10A2 of cAMP and cAMP-inhibited cGMP 3',5'-cyclic phosphodiesterase 10A (PDE10A2)
Synonyms:
PDE10A Phosphodiesterase 10A Phosphodiesterase 10A2 cAMP and cAMP-inhibited cGMP 3',5'-cyclic phosphodiesterase 10A (PDE10A2)
Type:
Enzyme
Mol. Mass.:
89387.03
Organism:
Homo sapiens (Human)
Description:
Q9Y233-2
Residue:
789
  
Inhibitor
Name:
BDBM234726
Synonyms:
US9353104, 14
Type:
Small organic molecule
Emp. Form.:
C21H26N6O2
Mol. Mass.:
394.4701
SMILES:
Cc1cc(CNc2cc(OC[C@H]3C[C@@H]3c3ccc(C)cn3)nn(C)c2=O)n(C)n1
: