Target
Carbonic anhydrase 2
Ligand
BDBM50028970
Substrate
Meas. Tech.
CA Activity Assay
pH
7.4±0
Temperature
298.15±0 K
Ki
3.8e+2±n/a nM
Citation
 Sentürk, MEkinci, DGöksu, SSupuran, CT Effects of dopaminergic compounds on carbonic anhydrase isozymes I, II, and VI. J Enzyme Inhib Med Chem 27:365-9 (2012)  
Target
Name:
Carbonic anhydrase 2
Synonyms:
CA-II CAC Carbonate dehydratase II Carbonic anhydrase 2 (CA-II) Carbonic anhydrase C Carbonic anhydrase II (CA-II) Carbonic anhydrase II (hCA II) | Carbonic anhydrase isoenzyme II (hCA II)
Type:
Enzyme
Mol. Mass.:
29250.71
Organism:
Homo sapiens (Human)
Description:
P00918
Residue:
260
  
Inhibitor
Name:
BDBM50028970
Synonyms:
6-Amino-5,6,7,8-tetrahydro-naphthalene-1,2-diol CHEMBL163912
Type:
Small organic molecule
Emp. Form.:
C10H13NO2
Mol. Mass.:
179.2157
SMILES:
NC1CCc2c(C1)ccc(O)c2O
: