Target
Acetylcholinesterase
Ligand
BDBM50259982
Substrate
Meas. Tech.
Measurement of IC50 of Eckol Derivatives Against Acetylcholinesterase and Butyrylcholinesterase
pH
7.4±n/a
Temperature
298.15±n/a K
IC50
45100±n/a nM
Comments
extracted
Citation
 Shin, HHwang, HPark, KYKim, SHLee, H Eckol derivatives, methods of synthesis and uses thereof US Patent  US10106521 Publication Date 10/23/2018 
Target
Name:
Acetylcholinesterase
Synonyms:
ACES_HUMAN Acetylcholinesterase (AChE) | Acetylcholinesterase (human AChE)
Type:
Enzyme
Mol. Mass.:
67792.70
Organism:
Homo sapiens (Human)
Description:
P22303
Residue:
614
  
Inhibitor
Name:
BDBM50259982
Synonyms:
CHEMBL471187 eckol
Type:
Small organic molecule
Emp. Form.:
C18H12O9
Mol. Mass.:
372.2825
SMILES:
Oc1cc(O)cc(Oc2c(O)cc(O)c3Oc4cc(O)cc(O)c4Oc23)c1
: