Target
Angiopoietin-1 receptor [776-1124]
Ligand
BDBM239570
Substrate
Meas. Tech.
Time-Resolved Fluorescence Resonance Energy Transfer (TR-FRET) Assay
pH
7±n/a
Temperature
295.15±n/a K
IC50
0.3±n/a nM
Comments
extracted
Citation
 Süβmeier, FLobell, MGrünewald, SHärter, MBuchmann, BTelser, JJöriβen, HHeroult, MKahnert, ALustig, KLindner, N Substituted phenylimidazopyrazoles and their use US Patent  US9394309 Publication Date 7/19/2016 
Target
Name:
Angiopoietin-1 receptor [776-1124]
Synonyms:
TEK TIE2_HUMAN VMCM | VMCM1
Type:
Enzyme
Mol. Mass.:
39865.58
Organism:
Homo sapiens (Human)
Description:
amino acids 776-1124
Residue:
349
  
Inhibitor
Name:
BDBM239570
Synonyms:
US9394309, 23
Type:
Small organic molecule
Emp. Form.:
C27H25F5N6O2S
Mol. Mass.:
592.583
SMILES:
Cc1ccc(NC(=O)c2cc(OCCCN)cc(c2)S(F)(F)(F)(F)F)cc1-n1ccn2nc(cc12)-c1cccnc1
: