Target
Angiopoietin-1 receptor [776-1124]
Ligand
BDBM239659
Substrate
Meas. Tech.
Time-Resolved Fluorescence Resonance Energy Transfer (TR-FRET) Assay
pH
7±n/a
Temperature
295.15±n/a K
IC50
0.8±n/a nM
Comments
extracted
Citation
 Süβmeier, FLobell, MGrünewald, SHärter, MBuchmann, BTelser, JJöriβen, HHeroult, MKahnert, ALustig, KLindner, N Substituted phenylimidazopyrazoles and their use US Patent  US9394309 Publication Date 7/19/2016 
Target
Name:
Angiopoietin-1 receptor [776-1124]
Synonyms:
TEK TIE2_HUMAN VMCM | VMCM1
Type:
Enzyme
Mol. Mass.:
39865.58
Organism:
Homo sapiens (Human)
Description:
amino acids 776-1124
Residue:
349
  
Inhibitor
Name:
BDBM239659
Synonyms:
US9394309, 115
Type:
Small organic molecule
Emp. Form.:
C28H27ClN6O
Mol. Mass.:
499.007
SMILES:
Cc1cc(C)c(cc1NC(=O)c1cc(Cl)nc(c1)C(C)(C)C)-n1ccn2nc(cc12)-c1cccnc1
: