Target
Nociceptin receptor
Ligand
BDBM239934
Substrate
Meas. Tech.
Binding Assay
pH
7.4±n/a
Ki
0.13±n/a nM
Comments
extracted
Citation
 Nolte, BSchröder, WLinz, KEnglberger, WSchick, HGraubaum, HBraun, BOzegowski, SBálint, JSonnenschein, H Substituted 4-aminocyclohexane derivatives US Patent  US9403767 Publication Date 8/2/2016 
Target
Name:
Nociceptin receptor
Synonyms:
KOR-3 Mu-type opioid receptor (Mu) Nociceptin Receptor (ORL1 Receptor) Nociceptin receptor (ORL-1) Nociceptin/Orphanin FQ, NOP receptor OPIATE ORL-1 OPRL1 protein ORL1 Opioid receptor like-1 Orphanin FQ receptor (ORL1) | P41146
Type:
G Protein-Coupled Receptor (GPCR)
Mol. Mass.:
40702.87
Organism:
Homo sapiens (Human)
Description:
P41146
Residue:
370
  
Inhibitor
Name:
BDBM239934
Synonyms:
US9403767, 117
Type:
Small organic molecule
Emp. Form.:
C28H31FN2O
Mol. Mass.:
430.5569
SMILES:
CN(C)C1(CCC(CC1)(N(C)C(=O)c1cccc(F)c1)c1ccccc1)c1ccccc1
: