Target
Protein mono-ADP-ribosyltransferase PARP3 [R100H]
Ligand
BDBM240720
Substrate
Meas. Tech.
Biochemical Assay
Kd
<10±n/a nM
Citation
 Papeo, GMCirla, AD'Anello, MScolaro, AZuccotto, F 3-phenyl-isoquinolin-1(2H)-one derivatives as PARP-1 inhibitors US Patent  US9422243 Publication Date 8/23/2016 
Target
Name:
Protein mono-ADP-ribosyltransferase PARP3 [R100H]
Synonyms:
(ARTD3 or PARP3) ADPRT3 Human diphtheria toxin-like ADP-ribosyltransferase (ARTD3 or PARP3) PARP3_HUMAN Poly [ADP-ribose] polymerase 3 (PARP-3) | Poly(ADP-ribose) polymerase-3 (ARTD3/PARP3)
Type:
PROTEIN
Mol. Mass.:
60071.85
Organism:
Homo sapiens (Human)
Description:
Q9Y6F1[R100H]
Residue:
533
  
Inhibitor
Name:
BDBM240720
Synonyms:
US9422243, 20
Type:
Small organic molecule
Emp. Form.:
C18H15FN2O4
Mol. Mass.:
342.3211
SMILES:
NCCOc1c([nH]c(=O)c2cc(F)ccc12)-c1ccc2OCOc2c1
: