Target
Poly [ADP-ribose] polymerase 1
Ligand
BDBM240704
Substrate
Meas. Tech.
PAR Assay
Temperature
310.15±n/a K
IC50
10±n/a nM
Comments
extracted
Citation
 Papeo, GMCirla, AD'Anello, MScolaro, AZuccotto, F 3-phenyl-isoquinolin-1(2H)-one derivatives as PARP-1 inhibitors US Patent  US9422243 Publication Date 8/23/2016 
Target
Name:
Poly [ADP-ribose] polymerase 1
Synonyms:
(ARTD1 or PARP1) 2.4.2.30 ADPRT ARTD1 Human diphtheria toxin-like ADP-ribosyltransferase (ARTD1 or PARP1) NT-PARP-1 PARP1 PPOL Poly [ADP-ribose] polymerase 1 (PARP) Poly [ADP-ribose] polymerase 1 (PARP1) Poly [ADP-ribose] polymerase 1, 28-kDa form Poly [ADP-ribose] polymerase 1, processed C-terminus Poly [ADP-ribose] polymerase-1 Poly(ADP-ribose) polymerase-1 (ARTD1/PARP1) Protein poly-ADP-ribosyltransferase PARP1 | Synonyms=ADPRT
Type:
Mol. Mass.:
113114.22
Organism:
Homo sapiens (Human)
Description:
P09874
Residue:
1014
  
Inhibitor
Name:
BDBM240704
Synonyms:
US9422243, 1
Type:
Small organic molecule
Emp. Form.:
C17H14BrFN2O2
Mol. Mass.:
377.208
SMILES:
NCCOc1c([nH]c(=O)c2cc(F)ccc12)-c1ccc(Br)cc1
: