Target
Epidermal growth factor receptor [G719S]
Ligand
BDBM5447
Substrate
Meas. Tech.
Kinase Assay
pH
7.5±n/a
Temperature
303.15±n/a K
IC50
6.7±n/a nM
Comments
extracted
Citation
 Burnet, MWThaher, BAEhlert, JKubbutat, MSchaechtele, CTotzke, F Kinase modulators for the treatment of cancer US Patent  US9416123 Publication Date 8/16/2016 
Target
Name:
Epidermal growth factor receptor [G719S]
Synonyms:
EGFR EGFR_HUMAN ERBB1 HER1
Type:
Enzyme Catalytic Domain
Mol. Mass.:
134309.61
Organism:
Homo sapiens (Human)
Description:
P00533[G719S]
Residue:
1210
  
Inhibitor
Name:
BDBM5447
Synonyms:
CHEMBL939 Iressa N-(3-chloro-4-fluorophenyl)-7-methoxy-6-[3-(morpholin-4-yl)propoxy]quinazolin-4-amine US10507209, Compound Gefitinib US9730934, Gefitinib WO2022090481, Example gefitinib cid_123631
Type:
Small organic molecule
Emp. Form.:
C22H24ClFN4O3
Mol. Mass.:
446.902
SMILES:
COc1cc2ncnc(Nc3ccc(F)c(Cl)c3)c2cc1OCCCN1CCOCC1
: