Target
Substance-K receptor
Ligand
BDBM242747
Substrate
Meas. Tech.
Binding Assay
pH
7.4±n/a
Temperature
298.15±n/a K
Ki
49000±n/a nM
Comments
extracted
Citation
 Hoveyda, HDutheuil, GFraser, G Substituted [1,2,4]triazolo[4,3-a]pyrazines as selective NK-3 receptor antagonists US Patent  US9422299 Publication Date 8/23/2016 
Target
Name:
Substance-K receptor
Synonyms:
NK-2 receptor NK2R NKNAR Neurokinin A receptor Neurokinin-2 (NK-2) SKR TACR2 Tachykinin receptor 2 (NK2) | hnk-3
Type:
Protein
Mol. Mass.:
44455.78
Organism:
Homo sapiens (Human)
Description:
P21452
Residue:
398
  
Inhibitor
Name:
BDBM242747
Synonyms:
US10030025, Compound 10 US11731974, Compound 10 US9987274, Compound 10
Type:
Small organic molecule
Emp. Form.:
C16H12F4N6OS
Mol. Mass.:
412.365
SMILES:
C[C@H]1N(CCn2c1nnc2-c1nc(C)ns1)C(=O)c1cc(F)c(F)c(F)c1F
: