Target
Tyrosine-protein kinase Fyn
Ligand
BDBM50142887
Substrate
Meas. Tech.
In Vitor Src Tyrosine Kinase Activity Assay
Temperature
295.15±0 K
IC50
0.5±0.0 nM
Citation
 Dincer, SCetin, KTOnay-Besikci, AÖlgen, S Synthesis, biological evaluation and docking studies of new pyrrolo[2,3-d] pyrimidine derivatives as Src family-selective tyrosine kinase inhibitors. J Enzyme Inhib Med Chem 28:1080-7 (2013)  
Target
Name:
Tyrosine-protein kinase Fyn
Synonyms:
FYN Proto-oncogene Syn SLK Src-like kinase | p59-Fyn
Type:
Enzyme
Mol. Mass.:
60762.21
Organism:
Homo sapiens (Human)
Description:
P06241
Residue:
537
  
Inhibitor
Name:
BDBM50142887
Synonyms:
1-(tert-butyl)-3-(4-chlorophenyl)-4-aminopyrazolo[3,4-d]pyrimidine 1-tert-butyl-3-(4-chlorophenyl)-1H-pyrazolo[3,4-d]pyrimidin-4-amine 4-amino-5-(4-chlorophenyl)-7-(tert-butyl)pyrazolo[3,4-d]pyrimidine CHEMBL406845 US10544104, Compound 146 US11701353, PP2 (Pfizer) cid_4878
Type:
Small organic molecule
Emp. Form.:
C15H16ClN5
Mol. Mass.:
301.774
SMILES:
CC(C)(C)n1nc(-c2ccc(Cl)cc2)c2c(N)ncnc12
: