Target
Xanthine dehydrogenase/oxidase
Ligand
BDBM244088
Substrate
Meas. Tech.
Control Assay
IC50
20000000000±n/a nM
Citation
 Ganesh, TSun, ASmith, SMLambeth, JD Piperazine derivatives, compositions, and uses related thereto US Patent  US9428478 Publication Date 8/30/2016 
Target
Name:
Xanthine dehydrogenase/oxidase
Synonyms:
XD XDHA XO Xanthine dehydrogenase/oxidase | Xanthine oxidase
Type:
Enzyme
Mol. Mass.:
146441.21
Organism:
Homo sapiens (Human)
Description:
P47989
Residue:
1333
  
Inhibitor
Name:
BDBM244088
Synonyms:
US9428478, TG6-239
Type:
Small organic molecule
Emp. Form.:
C23H23N3O4
Mol. Mass.:
405.4464
SMILES:
COc1ccc(cc1)N1CCN(CC1)C(=O)c1cnc2cc(ccc2c1O)C(C)=O
: