Target
Gamma carbonic anhydrase family protein
Ligand
BDBM26980
Substrate
Meas. Tech.
ChEMBL_158313 (CHEMBL763370)
pH
7.5±n/a
Temperature
293.15±n/a K
Ki
8700000±n/a nM
Citation
 Del Prete, SVullo, DDe Luca, VCarginale, Vdi Fonzo, POsman, SMAlOthman, ZSupuran, CTCapasso, C Anion inhibition profiles of a-, ß- and ¿-carbonic anhydrases from the pathogenic bacterium Vibrio cholerae. Bioorg Med Chem 24:3413-7 (2016)  
Target
Name:
Gamma carbonic anhydrase family protein
Synonyms:
Gamma-carbonic anhydrase | VchγCA
Type:
Protein
Mol. Mass.:
19753.38
Organism:
Vibrio cholerae
Description:
A0A0H7HLM5
Residue:
183
  
Inhibitor
Name:
BDBM26980
Synonyms:
Br- CHEMBL1644694 bromide ion
Type:
Ion
Emp. Form.:
Br
Mol. Mass.:
79.905
SMILES:
[Br-]
: